Target
Sphingosine 1-phosphate receptor 1
Ligand
BDBM23165
Substrate
Meas. Tech.
ChEMBL_1558238 (CHEMBL3772235)
EC50
20±n/a nM
Citation
 Demont, EHBailey, JMBit, RABrown, JACampbell, CADeeks, NDowell, SJEldred, CGaskin, PGray, JRHaynes, AHirst, DJHolmes, DSKumar, UMorse, MAOsborne, GJRenaux, JFSeal, GASmethurst, CATaylor, SWatson, RWillis, RWitherington, J Discovery of Tetrahydropyrazolopyridine as Sphingosine 1-Phosphate Receptor 3 (S1P3)-Sparing S1P1 Agonists Active at Low Oral Doses. J Med Chem 59:1003-20 (2016)  
Target
Name:
Sphingosine 1-phosphate receptor 1
Synonyms:
CHEDG1 Endothelial differentiation G-protein coupled receptor 1 S1P1 S1PR1_HUMAN Sphingosine 1-phosphate receptor Edg-1
Type:
Enzyme
Mol. Mass.:
42836.02
Organism:
Homo sapiens (Human)
Description:
P21453
Residue:
382
  
Inhibitor
Name:
BDBM23165
Synonyms:
CHEMBL366208 [(2S)-2-amino-3-hydroxy-2-[2-(4-octylphenyl)ethyl]propoxy]phosphonic acid
Type:
Small organic molecule
Emp. Form.:
C19H34NO5P
Mol. Mass.:
387.4507
SMILES:
CCCCCCCCc1ccc(CC[C@](N)(CO)COP(O)(O)=O)cc1
: