Target
5-hydroxytryptamine receptor 1A
Ligand
BDBM50151314
Substrate
Meas. Tech.
ChEMBL_1559212 (CHEMBL3771915)
Ki
319±n/a nM
Citation
 Kucwaj-Brysz, KWarszycki, DPodlewska, SWitek, JWitek, KGonzález Izquierdo, ASatala, GLoza, MILubelska, ALatacz, GBojarski, AJCastro, MKiec-Kononowicz, KHandzlik, J Rational design in search for 5-phenylhydantoin selective 5-HT7R antagonists. Molecular modeling, synthesis and biological evaluation. Eur J Med Chem 112:258-69 (2016)  
Target
Name:
5-hydroxytryptamine receptor 1A
Synonyms:
5-HT-1A 5-hydroxytryptamine receptor 1A (5-HT-1A) ADRB2RL1 Dopamine D2 receptor and serotonin 1a receptor HTR1A | Serotonin receptor 1A
Type:
Mol. Mass.:
46122.49
Organism:
Homo sapiens (Human)
Description:
Residue:
422
  
Inhibitor
Name:
BDBM50151314
Synonyms:
CHEMBL3770639
Type:
Small organic molecule
Emp. Form.:
C24H26FN5O3
Mol. Mass.:
451.4933
SMILES:
CC1(NC(=O)N(CC(O)CN2CCN(CC2)c2ccccc2C#N)C1=O)c1ccc(F)cc1
: