Target
Adenosine receptor A3
Ligand
BDBM50088421
Substrate
Meas. Tech.
ChEMBL_1560589 (CHEMBL3777321)
Ki
1.8±n/a nM
Citation
 Dosa, PIAmin, EA Tactical Approaches to Interconverting GPCR Agonists and Antagonists. J Med Chem 59:810-40 (2016)  
Target
Name:
Adenosine receptor A3
Synonyms:
A3 adenosine receptor (hA3) ADORA3 | Adenosine A3 receptor (A3AR)
Type:
G Protein-Coupled Receptor (GPCR)
Mol. Mass.:
36197.32
Organism:
Homo sapiens (Human)
Description:
P0DMS8
Residue:
318
  
Inhibitor
Name:
BDBM50088421
Synonyms:
(2R,3R,4S,5R)-2-[2-Chloro-6-(3-iodo-benzylamino)-purin-9-yl]-5-hydroxymethyl-tetrahydro-furan-3,4-diol CHEMBL307199
Type:
Small organic molecule
Emp. Form.:
C17H17ClIN5O4
Mol. Mass.:
517.705
SMILES:
OC[C@H]1O[C@H]([C@H](O)[C@@H]1O)n1cnc2c(NCc3cccc(I)c3)nc(Cl)nc12
: