Target
Death-associated protein kinase 1
Ligand
BDBM50166254
Substrate
Meas. Tech.
ChEMBL_1575378 (CHEMBL3802096)
IC50
450±n/a nM
Citation
 Jung, MEByun, BJKim, HMLee, JYPark, JHLee, NSon, YHChoi, SUYang, KMKim, SJLee, KKim, YCChoi, G Discovery of indirubin derivatives as new class of DRAK2 inhibitors from high throughput screening. Bioorg Med Chem Lett 26:2719-23 (2016)  
Target
Name:
Death-associated protein kinase 1
Synonyms:
Cellular tumor antigen p53/Death-associated protein kinase 1 DAPK DAPK1_HUMAN Death-associated protein kinase 1 (DAPK1) Death-associated protein kinase 3 (DAPK3)
Type:
PROTEIN
Mol. Mass.:
160053.35
Organism:
Homo sapiens (Human)
Description:
ChEMBL_1517177
Residue:
1430
  
Inhibitor
Name:
BDBM50166254
Synonyms:
CHEMBL3797466
Type:
Small organic molecule
Emp. Form.:
C21H18N4O3
Mol. Mass.:
374.3926
SMILES:
[#6]\[#6](-[#6])=[#6]\[#6](=O)-[#7]-c1ccc2-[#7]-[#6](=O)\[#6](=[#6]3/[#7]-c4ccccc4/[#6]/3=[#7]\[#8])-c2c1
: