Target
Platelet-derived growth factor receptor beta
Ligand
BDBM50192006
Substrate
Meas. Tech.
ChEMBL_1613238 (CHEMBL3855038)
IC50
9.5±n/a nM
Citation
 Shaw, DEBaig, FBruce, IChamoin, SCollingwood, SPCross, SDayal, SDrückes, PFuret, PFurminger, VHaggart, DHussey, MKonstantinova, ILoren, JCMolteni, VRoberts, SReilly, JSaunders, AMStringer, RSviridenko, LThomas, MThomson, CGTomlins, CWen, BYeh, VPearce, AC Optimization of Platelet-Derived Growth Factor Receptor (PDGFR) Inhibitors for Duration of Action, as an Inhaled Therapy for Lung Remodeling in Pulmonary Arterial Hypertension. J Med Chem 59:7901-14 (2016)  
Target
Name:
Platelet-derived growth factor receptor beta
Synonyms:
Beta-type platelet-derived growth factor receptor CD_antigen=CD140b PGFRB_RAT Pdgfr1 Platelet-derived growth factor receptor (PDGFr) Platelet-derived growth factor receptor beta (PDGFRB)
Type:
PROTEIN
Mol. Mass.:
122794.58
Organism:
Rattus norvegicus
Description:
ChEMBL_177425
Residue:
1097
  
Inhibitor
Name:
BDBM50192006
Synonyms:
CHEMBL3955987
Type:
Small organic molecule
Emp. Form.:
C27H30FN7O2
Mol. Mass.:
503.5712
SMILES:
Cn1nccc1-c1ccn2c(cnc2c1)C(=O)Nc1cc(ccc1F)C(=O)NCCN1CCCC1(C)C
: