Target
Alpha-1B adrenergic receptor
Ligand
BDBM50198642
Substrate
Meas. Tech.
ChEMBL_1620802 (CHEMBL3863085)
EC50
461±n/a nM
Citation
 Rak, ACanale, VMarciniec, KZmudzki, PKotanska, MKnutelska, JSiwek, AStachowicz, GBednarski, MNowinski, LZygmunt, MZajdel, PSapa, J Arylsulfonamide derivatives of (aryloxy)ethyl pyrrolidines and piperidines asa Bioorg Med Chem 24:5582-5591 (2016)  
Target
Name:
Alpha-1B adrenergic receptor
Synonyms:
ADA1B_HUMAN Adrenergic alpha1B Adrenergic receptor alpha Alpha 1B-adrenoreceptor | Alpha-1B adrenergic receptor
Type:
Enzyme
Mol. Mass.:
56862.13
Organism:
Homo sapiens (Human)
Description:
P35368
Residue:
520
  
Inhibitor
Name:
BDBM50198642
Synonyms:
CHEMBL3948333
Type:
Small organic molecule
Emp. Form.:
C22H30N2O6S
Mol. Mass.:
450.548
SMILES:
COc1ccccc1OCCN1CCC(CC1)NS(=O)(=O)c1ccc(OC)c(OC)c1
: