Target
D(2) dopamine receptor
Ligand
BDBM50208474
Substrate
Meas. Tech.
ChEMBL_1632884 (CHEMBL3875676)
Ki
38±n/a nM
Citation
 Cao, XChen, YZhang, YQiu, YYu, MXu, XLiu, XLiu, BFZhang, G Synthesis and biological evaluation of new 6-hydroxypyridazinone benzisoxazoles: Potential multi-receptor-targeting atypical antipsychotics. Eur J Med Chem 124:713-728 (2016)  
Target
Name:
D(2) dopamine receptor
Synonyms:
DOPAMINE D2 DOPAMINE D2 Short Dopamine D2 receptor Drd2
Type:
G Protein-Coupled Receptor (GPCR)
Mol. Mass.:
50931.60
Organism:
Rattus norvegicus (rat)
Description:
P61169
Residue:
444
  
Inhibitor
Name:
BDBM50208474
Synonyms:
CHEMBL3884066
Type:
Small organic molecule
Emp. Form.:
C25H23Cl2FN4O3
Mol. Mass.:
517.38
SMILES:
Fc1ccc2c(noc2c1)C1CCN(CCCOc2ccc(=O)n(n2)-c2cc(Cl)cc(Cl)c2)CC1
: