Target
Histone deacetylase 8
Ligand
BDBM50209796
Substrate
Meas. Tech.
ChEMBL_1634162 (CHEMBL3876954)
IC50
394±n/a nM
Citation
 Raji, IYadudu, FJaneira, EFathi, SSzymczak, LKornacki, JRKomatsu, KLi, JDMrksich, MOyelere, AK Bifunctional conjugates with potent inhibitory activity towards cyclooxygenase and histone deacetylase. Bioorg Med Chem 25:1202-1218 (2017)  
Target
Name:
Histone deacetylase 8
Synonyms:
HD8 HDAC8_HUMAN Histone deacetylase 8 (HDAC-8) | Human HDAC8
Type:
Enzyme
Mol. Mass.:
41749.60
Organism:
Homo sapiens (Human)
Description:
Q9BY41
Residue:
377
  
Inhibitor
Name:
BDBM50209796
Synonyms:
CHEMBL3885011
Type:
Small organic molecule
Emp. Form.:
C30H37N5O5
Mol. Mass.:
547.6453
SMILES:
COC(=O)Cc1c(C)n(Cc2ccc(cc2)-c2cn(CCCCCCCC(=O)NO)nn2)c2ccc(OC)cc12
: