Target
Histone deacetylase 8
Ligand
BDBM50209795
Substrate
Meas. Tech.
ChEMBL_1634162 (CHEMBL3876954)
IC50
226±n/a nM
Citation
 Raji, IYadudu, FJaneira, EFathi, SSzymczak, LKornacki, JRKomatsu, KLi, JDMrksich, MOyelere, AK Bifunctional conjugates with potent inhibitory activity towards cyclooxygenase and histone deacetylase. Bioorg Med Chem 25:1202-1218 (2017)  
Target
Name:
Histone deacetylase 8
Synonyms:
HD8 HDAC8_HUMAN Histone deacetylase 8 (HDAC-8) | Human HDAC8
Type:
Enzyme
Mol. Mass.:
41749.60
Organism:
Homo sapiens (Human)
Description:
Q9BY41
Residue:
377
  
Inhibitor
Name:
BDBM50209795
Synonyms:
CHEMBL3884044
Type:
Small organic molecule
Emp. Form.:
C23H25F3N4O4S
Mol. Mass.:
510.529
SMILES:
Cc1ccc(cc1)-c1cc(nn1-c1ccc(cc1)S(=O)(=O)NCCCCCC(=O)NO)C(F)(F)F
: