Target
D(1A)/D(2) dopamine receptor
Ligand
BDBM50001955
Substrate
Meas. Tech.
ChEMBL_59584 (CHEMBL672935)
IC50
15±n/a nM
Citation
 Nordmann, RPetcher, TJ Octahydrobenzo[g]quinolines: potent dopamine agonists which show the relationship between ergolines and apomorphine. J Med Chem 28:367-75 (1985)  
Target
Name:
D(1A)/D(2) dopamine receptor
Synonyms:
Dopamine receptor
Type:
Mol. Mass.:
Description:
ASSAY_ID of ChEMBL is 59578
Components:
This complex has 2 components.
Component 1
Name:
D(2) dopamine receptor
Synonyms:
DOPAMINE D2 DRD2_BOVIN | Dopamine D2 receptor
Type:
Enzyme Catalytic Domain
Mol. Mass.:
50698.79
Organism:
BOVINE
Description:
P20288
Residue:
444
  
Component 2
Name:
D(1A) dopamine receptor
Synonyms:
D(1A) dopamine receptor DOPAMINE D1 DRD1_BOVIN | Dopamine receptor
Type:
Enzyme Catalytic Domain
Mol. Mass.:
49330.65
Organism:
BOVINE
Description:
DOPAMINE D1 DRD1 BOVINE::Q95136
Residue:
446
  
Inhibitor
Name:
BDBM50001955
Synonyms:
(-)6-Methyl-5,6,6a,7-tetrahydro-4H-dibenzo[de,g]quinoline-10,11-diol(APO) (R)-6-Methyl-5,6,6a,7-tetrahydro-4H-dibenzo[de,g]quinoline-10,11-diol ((R)-apomorphine) (R)-6-Methyl-5,6,6a,7-tetrahydro-4H-dibenzo[de,g]quinoline-10,11-diol(apomorphine) 6-Methyl-5,6,6a,7-tetrahydro-4H-dibenzo[de,g]quinoline-10,11-diol 6-Methyl-5,6,6a,7-tetrahydro-4H-dibenzo[de,g]quinoline-10,11-diol((R)-apomorphine) APOMORPHINE APOMORPHINE6-Methyl-5,6,6a,7-tetrahydro-4H-dibenzo[de,g]quinoline-10,11-diol | CHEMBL53
Type:
Small organic molecule
Emp. Form.:
C17H17NO2
Mol. Mass.:
267.3224
SMILES:
CN1CCc2cccc-3c2[C@H]1Cc1ccc(O)c(O)c-31
: