Target
Type-1/Type-2 angiotensin II receptor
Ligand
BDBM50230885
Substrate
Meas. Tech.
ChEMBL_162637 (CHEMBL772135)
IC50
57±n/a nM
Citation
 Sircar, IHodges, JCQuin, JBunker, AMWinters, RTEdmunds, JJKostlan, CRConnolly, CKesten, SJHamby, JM Nonpeptide angiotensin II receptor antagonists. 2. Design, synthesis, and structure-activity relationships of 2-alkyl-4-(1H-pyrrol-1-yl)-1H-imidazole derivatives: profile of 2-propyl-1-[[2'-(1H-tetrazol-5-yl)-[1,1' -biphenyl]-4-yl]-methyl]-4-[2-(trifluoroacetyl)-1H-pyrrol-1-yl]-1H- imidazole-5-car J Med Chem 36:2253-65 (1993)  
Target
Name:
Type-1/Type-2 angiotensin II receptor
Synonyms:
Angiotensin II receptor
Type:
Mol. Mass.:
Description:
ASSAY_ID of ChEMBL is 357784
Components:
This complex has 2 components.
Component 1
Name:
Type-1 angiotensin II receptor
Synonyms:
AGTR1 AGTR1B AT1 AT1BR AT2R1B Angiotensin II receptor Type-1 angiotensin II receptor (AT1)
Type:
Protein
Mol. Mass.:
41080.75
Organism:
Homo sapiens (Human)
Description:
P30556
Residue:
359
  
Component 2
Name:
Type-2 angiotensin II receptor
Synonyms:
AGTR2 AT2 Angiotensin II type 2 (AT-2) receptor Type-2 angiotensin II receptor
Type:
Enzyme Catalytic Domain
Mol. Mass.:
41201.61
Organism:
Homo sapiens (Human)
Description:
Angiotensin II, central 0 0::P50052
Residue:
363
  
Inhibitor
Name:
BDBM50230885
Synonyms:
CHEMBL72453
Type:
Small organic molecule
Emp. Form.:
C26H24N8O3
Mol. Mass.:
496.5206
SMILES:
CCCc1nc(c(C(N)=O)n1Cc1ccc(cc1)-c1ccccc1-c1nn[nH]n1)-n1cccc1C(O)=O
: