Target
Histone deacetylase 2
Ligand
BDBM50232357
Substrate
Meas. Tech.
ChEMBL_1646419 (CHEMBL3995475)
IC50
969±n/a nM
Citation
 Nepali, KLee, HYLai, MJOjha, RWu, TYWu, GXChen, MCLiou, JP Ring-opened tetrahydro-¿-carbolines display cytotoxicity and selectivity with histone deacetylase isoforms. Eur J Med Chem 127:115-127 (2017)  
Target
Name:
Histone deacetylase 2
Synonyms:
Cereblon/Histone deacetylase 2 HDAC2 Histone deacetylase 2 (HDAC2) | Human HDAC2
Type:
Chromatin regulator; hydrolase; repressor
Mol. Mass.:
55356.54
Organism:
Homo sapiens (Human)
Description:
Q92769
Residue:
488
  
Inhibitor
Name:
BDBM50232357
Synonyms:
CHEMBL4077893
Type:
Small organic molecule
Emp. Form.:
C20H21N3O4S
Mol. Mass.:
399.463
SMILES:
CN(C)Cc1cn(c2ccccc12)S(=O)(=O)c1ccc(\C=C\C(=O)NO)cc1
: