Target
Mitogen-activated protein kinase 14
Ligand
BDBM84796
Substrate
MAP kinase-activated protein kinase 2
Meas. Tech.
Active p38alpha cascade assay
pH
7.5±0
Temperature
298.15±0 K
IC50
1.8±0.0 nM
Citation
 Tecle, HFeru, FLiu, HKuhn, CRennie, GMorris, MShao, JCheng, ACGikunju, DMiret, JColi, RXi, SHClugston, SLLow, SKazmirski, SDing, YHCao, QJohnson, TLDeshmukh, GDDiNitto, JPWu, JCEnglish, JM The design, synthesis and potential utility of fluorescence probes that target DFG-out conformation of p38alpha for high throughput screening binding assay. Chem Biol Drug Des 74:547-59 (2009)  
Target
Name:
Mitogen-activated protein kinase 14
Synonyms:
CSAID-binding protein CSBP1 CSPB1 MAP kinase 14 MAP kinase p38 alpha MAPK14 MK14_HUMAN Mitogen-activated protein kinase p38 alpha Stress-activated protein kinase 2a | p38 MAP kinase alpha/beta
Type:
Serine/threonine-protein kinase
Mol. Mass.:
41286.76
Organism:
Homo sapiens (Human)
Description:
Q16539
Residue:
360
  
Inhibitor
Name:
BDBM84796
Synonyms:
PF-00215924
Type:
Emp. Form.:
C18H12ClN3
Mol. Mass.:
305.761
SMILES:
Clc1ccc(cc1)-c1c[nH]c(n1)-c1cc2ccccc2cn1
:
Substrate
Name:
MAP kinase-activated protein kinase 2
Synonyms:
MAP kinase-activated protein kinase 2 (MAPKAPK2) MAP kinase-activated protein kinase 2 (p38/MK2) MAPK-activated protein kinase 2 MAPKAP kinase 2 MAPKAPK2 | MK2
Type:
Serine/threonine-protein kinase
Mol. Mass.:
45579.87
Organism:
Homo sapiens (Human)
Description:
P49137
Residue:
400