Target
Mu-type opioid receptor
Ligand
BDBM85732
Substrate
Ki
0.192±n/a nM
Comments
PDSP_3257
Citation
 Schiller, PWNguyen, TMBerezowska, IDupuis, SWeltrowska, GChung, NNLemieux, C Synthesis and in vitro opioid activity profiles of DALDA analogues. Eur J Med Chem 35:895-901 (2000)  
Target
Name:
Mu-type opioid receptor
Synonyms:
M-OR-1 Mu opioid receptor OPIATE Mu OPRM_CAVPO
Type:
Enzyme Catalytic Domain
Mol. Mass.:
11165.58
Organism:
GUINEA PIG
Description:
P97266
Residue:
98
  
Inhibitor
Name:
BDBM85732
Synonyms:
Tmt-D-Arg-Phe-Lys-NH2
Type:
Small organic molecule
Emp. Form.:
C33H51N9O5
Mol. Mass.:
653.8153
SMILES:
[#6]-[#7]-[#6@@H](-[#6]-c1c(-[#6])cc(-[#8])cc1-[#6])-[#6](=O)-[#7]-[#6@H](-[#6]-[#6]-[#6]\[#7]=[#6](\[#7])-[#7])-[#6](=O)-[#7]-[#6@@H](-[#6]-c1ccccc1)-[#6](=O)-[#7]-[#6@@H](-[#6]-[#6]-[#6]-[#6]-[#7])-[#6](-[#7])=O
: