Target
Beta-3 adrenergic receptor
Ligand
BDBM25751
Substrate
Ki
9070±n/a nM
Comments
PDSP_4085
Citation
 Hoffmann, CLeitz, MROberdorf-Maass, SLohse, MJKlotz, KN Comparative pharmacology of human beta-adrenergic receptor subtypes--characterization of stably transfected receptors in CHO cells. Naunyn Schmiedebergs Arch Pharmacol 369:151-9 (2004)  
Target
Name:
Beta-3 adrenergic receptor
Synonyms:
ADRB3 ADRB3_HUMAN Beta-2 adrenergic receptor and beta-3 adrenergic receptor Beta-3 adrenoreceptor | adrenergic Beta3
Type:
G Protein-Coupled Receptor (GPCR)
Mol. Mass.:
43534.88
Organism:
Homo sapiens (Human)
Description:
Residue:
408
  
Inhibitor
Name:
BDBM25751
Synonyms:
Bisoprolol Concor | [2-hydroxy-3-(4-{[2-(propan-2-yloxy)ethoxy]methyl}phenoxy)propyl](propan-2-yl)amine
Type:
Small organic molecule
Emp. Form.:
C18H31NO4
Mol. Mass.:
325.443
SMILES:
CC(C)NCC(O)COc1ccc(COCCOC(C)C)cc1
: