Target
Histamine H1 receptor
Ligand
BDBM86740
Substrate
Ki
1600±n/a nM
Comments
PDSP_6456
Citation
 Xie, SXKraus, AGhorai, PYe, QZElz, SBuschauer, ASeifert, R N1-(3-cyclohexylbutanoyl)-N2-[3-(1H-imidazol-4-yl)propyl]guanidine (UR-AK57), a potent partial agonist for the human histamine H1- and H2-receptors. J Pharmacol Exp Ther 317:1262-8 (2006)  
Target
Name:
Histamine H1 receptor
Synonyms:
HISTAMINE H1 HRH1_CAVPO
Type:
G Protein-Coupled Receptor (GPCR)
Mol. Mass.:
55641.53
Organism:
Cavia porcellus (domestic guinea pig)
Description:
Guinea pig cerebellum was used in binding assay.
Residue:
488
  
Inhibitor
Name:
BDBM86740
Synonyms:
UR-AK24 | UR-AK57
Type:
Small organic molecule
Emp. Form.:
C17H29N5O
Mol. Mass.:
319.4451
SMILES:
CC(CC(=O)NC(N)=NCCCc1cnc[nH]1)C1CCCCC1
: