Target
D(1A) dopamine receptor
Ligand
BDBM86892
Substrate
Ki
26.5±n/a nM
Comments
PDSP_8400
Citation
 Si, YGGardner, MPTarazi, FIBaldessarini, RJNeumeyer, JL Synthesis and dopamine receptor affinities of N-alkyl-11-hydroxy-2-methoxynoraporphines: N-alkyl substituents determine D1 versus D2 receptor selectivity. J Med Chem 51:983-7 (2008)  
Target
Name:
D(1A) dopamine receptor
Synonyms:
DOPAMINE D1 Dopamine D1 high Dopamine receptor Dopamine1-like Drd1a
Type:
Enzyme Catalytic Domain
Mol. Mass.:
49429.75
Organism:
RAT
Description:
P18901
Residue:
446
  
Inhibitor
Name:
BDBM86892
Synonyms:
(R)-6-Methyl-5,6,6a,7-tetrahydro-4H-dibenzo[de,g]quinolin-11-ol NSC_10015045
Type:
Small organic molecule
Emp. Form.:
C17H17NO
Mol. Mass.:
251.323
SMILES:
CN1CCc2cccc-3c2C1Cc1cccc(O)c-31
: