Target
Amine oxidase [flavin-containing] B
Ligand
BDBM92981
Substrate
Meas. Tech.
Inhibiton Assay
IC50
1.2e+4±n/a nM
Citation
 Krueger, MJEfange, SMMichelson, RHSinger, TP Interaction of flexible analogs of N-methyl-4-phenyl-1,2,3,6-tetrahydropyridine and of N-methyl-4-phenylpyridinium with highly purified monoamine oxidase A and B. Biochemistry 31:5611-5 (1992)  
Target
Name:
Amine oxidase [flavin-containing] B
Synonyms:
AOFB_HUMAN MAOB Monoamine oxidase type B (MAO B) Monoamine oxidase type B (MAOB)
Type:
Protein
Mol. Mass.:
58768.76
Organism:
Homo sapiens (Human)
Description:
P27338
Residue:
520
  
Inhibitor
Name:
BDBM92981
Synonyms:
MPP analogue, 17
Type:
Small molecule
Emp. Form.:
C14H16N
Mol. Mass.:
198.283
SMILES:
C[n+]1ccc(CCc2ccccc2)cc1
: