Target
Epidermal growth factor receptor
Ligand
BDBM4299
Substrate
Poly(GAT)
Meas. Tech.
EGFR assay
IC50
3100±n/a nM
Citation
 Gazit, AOsherov, NPosner, IYaish, PPoradosu, EGilon, CLevitzki, A Tyrphostins. 2. Heterocyclic and alpha-substituted benzylidenemalononitrile tyrphostins as potent inhibitors of EGF receptor and ErbB2/neu tyrosine kinases. J Med Chem 34:1896-907 (1991)  
Target
Name:
Epidermal growth factor receptor
Synonyms:
EGF Receptor Substrate EGFR_HUMAN ERBB1 Epidermal Growth Factor Receptor erbB-1 Epidermal growth factor receptor (EGFR) HER1 Proto-oncogene c-ErbB-1 Tyrosine-Protein Kinase ErbB-1
Type:
Receptor Kinase Domain
Mol. Mass.:
134279.59
Organism:
Homo sapiens (Human)
Description:
P00533
Residue:
1210
  
Inhibitor
Name:
BDBM4299
Synonyms:
(2E)-3-(3,4-dihydroxyphenyl)-2-(thiophen-2-ylcarbonyl)prop-2-enenitrile Tyrphostin deriv. 36
Type:
Small organic molecule
Emp. Form.:
C14H9NO3S
Mol. Mass.:
271.291
SMILES:
Oc1ccc(\C=C(/C#N)C(=O)c2cccs2)cc1O
:
Substrate
Name:
Poly(GAT)
Synonyms:
Type:
Peptide
Mol. Mass.:
358.43
Organism:
Description:
poly(Glu6Ala3Tyr). 125 uM [gamma-32P]ATP as co-substrate.
Residue:
3
NA