Target
Epidermal growth factor receptor
Ligand
BDBM4335
Substrate
Poly(GAT)
Meas. Tech.
EGFR assay
pH
7.6±n/a
Temperature
295.15±n/a K
Ki
49000±n/a nM
IC50
125000±n/a nM
Citation
 Gazit, AYaish, PGilon, CLevitzki, A Tyrphostins I: synthesis and biological activity of protein tyrosine kinase inhibitors. J Med Chem 32:2344-52 (1989)  
Target
Name:
Epidermal growth factor receptor
Synonyms:
EGF Receptor Substrate EGFR_HUMAN ERBB1 Epidermal Growth Factor Receptor erbB-1 Epidermal growth factor receptor (EGFR) HER1 Proto-oncogene c-ErbB-1 Tyrosine-Protein Kinase ErbB-1
Type:
Receptor Kinase Domain
Mol. Mass.:
134279.59
Organism:
Homo sapiens (Human)
Description:
P00533
Residue:
1210
  
Inhibitor
Name:
BDBM4335
Synonyms:
2-[(4-hydroxy-3-nitrophenyl)methylidene]propanedinitrile | benzylidenemalononitrile (BMN) deriv. 19
Type:
Small organic molecule
Emp. Form.:
C10H5N3O3
Mol. Mass.:
215.165
SMILES:
[#8]-c1ccc(\[#6]=[#6](/C#N)C#N)cc1-[#7+](-[#8-])=O
:
Substrate
Name:
Poly(GAT)
Synonyms:
Type:
Peptide
Mol. Mass.:
358.43
Organism:
Description:
poly(Glu6Ala3Tyr). 125 uM [gamma-32P]ATP as co-substrate.
Residue:
3
NA