Target
Epidermal growth factor receptor
Ligand
BDBM4356
Substrate
Poly(GAT)
Meas. Tech.
EGFR assay
Ki
360000±n/a nM
IC50
625000±n/a nM
Citation
 Gazit, AYaish, PGilon, CLevitzki, A Tyrphostins I: synthesis and biological activity of protein tyrosine kinase inhibitors. J Med Chem 32:2344-52 (1989)  
Target
Name:
Epidermal growth factor receptor
Synonyms:
EGF Receptor Substrate EGFR_HUMAN ERBB1 Epidermal Growth Factor Receptor erbB-1 Epidermal growth factor receptor (EGFR) HER1 Proto-oncogene c-ErbB-1 Tyrosine-Protein Kinase ErbB-1
Type:
Receptor Kinase Domain
Mol. Mass.:
134279.59
Organism:
Homo sapiens (Human)
Description:
P00533
Residue:
1210
  
Inhibitor
Name:
BDBM4356
Synonyms:
(2E)-2-cyano-N-(cyanomethyl)-3-(4-hydroxyphenyl)prop-2-enamide | benzylidenemalononitrile (BMN) deriv. 40
Type:
Small organic molecule
Emp. Form.:
C12H9N3O2
Mol. Mass.:
227.2188
SMILES:
Oc1ccc(\C=C(/C#N)C(=O)NCC#N)cc1
:
Substrate
Name:
Poly(GAT)
Synonyms:
Type:
Peptide
Mol. Mass.:
358.43
Organism:
Description:
poly(Glu6Ala3Tyr). 125 uM [gamma-32P]ATP as co-substrate.
Residue:
3
NA