Target
Epidermal growth factor receptor
Ligand
BDBM4374
Substrate
Poly(GAT)
Meas. Tech.
EGFR assay
Ki
1000000±n/a nM
IC50
3000000±n/a nM
Citation
 Gazit, AYaish, PGilon, CLevitzki, A Tyrphostins I: synthesis and biological activity of protein tyrosine kinase inhibitors. J Med Chem 32:2344-52 (1989)  
Target
Name:
Epidermal growth factor receptor
Synonyms:
EGF Receptor Substrate EGFR_HUMAN ERBB1 Epidermal Growth Factor Receptor erbB-1 Epidermal growth factor receptor (EGFR) HER1 Proto-oncogene c-ErbB-1 Tyrosine-Protein Kinase ErbB-1
Type:
Receptor Kinase Domain
Mol. Mass.:
134279.59
Organism:
Homo sapiens (Human)
Description:
P00533
Residue:
1210
  
Inhibitor
Name:
BDBM4374
Synonyms:
(2E)-3-(4-hydroxyphenyl)prop-2-enoic acid CHEMBL66879 p-Hydroxycinnamic acid (p-HCA) p-hydroxycinnamic acid (M4)
Type:
Small organic molecule
Emp. Form.:
C9H8O3
Mol. Mass.:
164.158
SMILES:
OC(=O)\C=C\c1ccc(O)cc1
:
Substrate
Name:
Poly(GAT)
Synonyms:
Type:
Peptide
Mol. Mass.:
358.43
Organism:
Description:
poly(Glu6Ala3Tyr). 125 uM [gamma-32P]ATP as co-substrate.
Residue:
3
NA