Target
Heat shock protein HSP 90-alpha
Ligand
BDBM110220
Substrate
Meas. Tech.
Fluorescence Polarization Assay
pH
7.3±0
IC50
10±0 nM
Citation
 Lawson, JDCo, EWStafford, JA HSP90 inhibitors US Patent  US8618290 Publication Date 12/31/2013 
Target
Name:
Heat shock protein HSP 90-alpha
Synonyms:
HS90A_HUMAN HSP86 HSP90AA1 HSPCA Heat shock 86 kDa Heat shock protein HSP 90-alpha (HSP90) LAP-2 Lipopolysaccharide-associated protein 2 heat shock protein 90kDa alpha (cytosolic), class A member 1 isoform 2
Type:
Molecular Chaperone
Mol. Mass.:
84623.45
Organism:
Homo sapiens (Human)
Description:
P07900
Residue:
732
  
Inhibitor
Name:
BDBM110220
Synonyms:
US8618290, 45
Type:
Small organic molecule
Emp. Form.:
C26H29FN6O6
Mol. Mass.:
540.5435
SMILES:
CO[C@@H]1OC(CONC2=N[C@H](Cc3nc(N)nc(C)c23)c2ccc(F)cc2-c2cccc(OC)n2)[C@@H](O)[C@H]1O
: