Target
Tyrosine-protein phosphatase non-receptor type 1
Ligand
BDBM124235
Substrate
Meas. Tech.
pNPP assay
IC50
1.897e+4± 3.85e+3 nM
Citation
 Wang, WLHuang, CGao, LXTang, CLWang, JQWu, MCSheng, LChen, HJNan, FJLi, JYLi, JFeng, B Synthesis and biological evaluation of novel bis-aromatic amides as novel PTP1B inhibitors. Bioorg Med Chem Lett 24:1889-94 (2014)  
Target
Name:
Tyrosine-protein phosphatase non-receptor type 1
Synonyms:
PTN1_HUMAN PTPN1 Protein tyrosine phosphatase-1B (PTP1B) Protein-tyrosine phosphatase 1B (PTP1B) Tyrosine-protein phosphatase non-receptor type 1 (PTP1B)
Type:
Protein phosphatase
Mol. Mass.:
49963.76
Organism:
Homo sapiens (Human)
Description:
Human recombinant GST-fusion PTP1B (1-435).
Residue:
435
  
Inhibitor
Name:
BDBM124235
Synonyms:
N,N'-([1,1'-biphenyl]-4,4'-diyl)bis(4-fluorobenzamide) (6)
Type:
Small organic molecule
Emp. Form.:
C26H18F2N2O2
Mol. Mass.:
428.4301
SMILES:
Fc1ccc(cc1)C(=O)Nc1ccc(cc1)-c1ccc(NC(=O)c2ccc(F)cc2)cc1
: