Target
Cannabinoid receptor 2
Ligand
BDBM9651
Substrate
Meas. Tech.
Radioligand Binding Assay
pH
7.4±n/a
Temperature
303.15±n/a K
Ki
0.7±n/a nM
Comments
extracted
Citation
 Carroll, WADart, MJFrost, JMKolasa, TLi, TLiu, BPerez-Medrano, APatel, MWang, XPeddi, S Compounds as cannabinoid receptor ligands US Patent  US8846730 Publication Date 9/30/2014 
Target
Name:
Cannabinoid receptor 2
Synonyms:
CANNABINOID CB2 CB2 CB2B CNR2_HUMAN Cannabinoid CB2 receptor Cannabinoid receptor 2 (CB2R) | hCB2
Type:
G Protein-Coupled Receptor (GPCR)
Mol. Mass.:
39690.94
Organism:
Homo sapiens (Human)
Description:
P34972
Residue:
360
  
Inhibitor
Name:
BDBM9651
Synonyms:
US8846730, 4
Type:
Emp. Form.:
C26H34F3N3O3S
Mol. Mass.:
525.627
SMILES:
CC(C)(C)c1cn(C[C@H]2CCCO2)\c(=N\C(=O)c2cc(ccc2OC[C@@H]2CCCCN2)C(F)(F)F)s1
: