Target
Cannabinoid receptor 2
Ligand
BDBM9807
Substrate
Meas. Tech.
Radioligand Binding Assay
pH
7.4±n/a
Temperature
303.15±n/a K
Ki
0.5±n/a nM
Comments
extracted
Citation
 Carroll, WADart, MJFrost, JMKolasa, TLi, TLiu, BPerez-Medrano, APatel, MWang, XPeddi, S Compounds as cannabinoid receptor ligands US Patent  US8846730 Publication Date 9/30/2014 
Target
Name:
Cannabinoid receptor 2
Synonyms:
CANNABINOID CB2 CB2 Cannabinoid CB2 receptor Cnr2 | rCB2
Type:
Enzyme
Mol. Mass.:
39366.68
Organism:
Rattus norvegicus (Rat)
Description:
Q9QZN9
Residue:
360
  
Inhibitor
Name:
BDBM9807
Synonyms:
US8846730, 50
Type:
Emp. Form.:
C25H33F3N2O4S
Mol. Mass.:
514.601
SMILES:
CC(C)(O)CCOc1ccc(cc1C(=O)\N=c1/sc(cn1C[C@H]1CCCO1)C(C)(C)C)C(F)(F)F
: