Target
Cannabinoid receptor 2
Ligand
BDBM135882
Substrate
Meas. Tech.
Radioligand Binding Assay
pH
7.4±n/a
Temperature
303.15±n/a K
Ki
0.6±n/a nM
Comments
extracted
Citation
 Carroll, WADart, MJFrost, JMLatshaw, SPKolasa, TLi, TPeddi, SLiu, BPerez-Medrano, APatel, MWang, XNelson, DW Compounds as cannabinoid receptor ligands US Patent  US8859596 Publication Date 10/14/2014 
Target
Name:
Cannabinoid receptor 2
Synonyms:
CANNABINOID CB2 CB2 CB2B CNR2_HUMAN Cannabinoid CB2 receptor Cannabinoid receptor 2 (CB2R) | hCB2
Type:
G Protein-Coupled Receptor (GPCR)
Mol. Mass.:
39690.94
Organism:
Homo sapiens (Human)
Description:
P34972
Residue:
360
  
Inhibitor
Name:
BDBM135882
Synonyms:
US8859596, 169
Type:
Small organic molecule
Emp. Form.:
C23H31F3N4O3S
Mol. Mass.:
500.577
SMILES:
CCCCn1nc(s\c1=N/C(=O)c1cc(ccc1ONC(=O)C(C)(C)C)C(F)(F)F)C(C)(C)C
: