Target
Cannabinoid receptor 2
Ligand
BDBM135909
Substrate
Meas. Tech.
Radioligand Binding Assay
pH
7.4±n/a
Temperature
303.15±n/a K
Ki
0.4±n/a nM
Comments
extracted
Citation
 Carroll, WADart, MJFrost, JMLatshaw, SPKolasa, TLi, TPeddi, SLiu, BPerez-Medrano, APatel, MWang, XNelson, DW Compounds as cannabinoid receptor ligands US Patent  US8859596 Publication Date 10/14/2014 
Target
Name:
Cannabinoid receptor 2
Synonyms:
CANNABINOID CB2 CB2 CB2B CNR2_HUMAN Cannabinoid CB2 receptor Cannabinoid receptor 2 (CB2R) | hCB2
Type:
G Protein-Coupled Receptor (GPCR)
Mol. Mass.:
39690.94
Organism:
Homo sapiens (Human)
Description:
P34972
Residue:
360
  
Inhibitor
Name:
BDBM135909
Synonyms:
US8859596, 198
Type:
Small organic molecule
Emp. Form.:
C25H36F3N5O2
Mol. Mass.:
495.5808
SMILES:
CCCCn1n(C)c(c\c1=N/C(=O)c1cc(ccc1NNC(=O)C(C)(C)C)C(F)(F)F)C(C)(C)C
: