Target
Glutaminyl-peptide cyclotransferase
Ligand
BDBM179612
Substrate
Meas. Tech.
Fluorometric Assay
pH
8±n/a
Temperature
303.15±n/a K
Ki
740±n/a nM
IC50
7300±n/a nM
Comments
extracted
Citation
 Heiser, URamsbeck, DBuchholz, MNiestroj, AJ Inhibitors of glutaminyl cyclase US Patent  US9126987 Publication Date 9/8/2015 
Target
Name:
Glutaminyl-peptide cyclotransferase
Synonyms:
Glutaminyl Cyclase Glutaminyl-peptide cyclotransferase Glutaminyl-tRNA cyclotransferase QPCT | QPCT_HUMAN
Type:
Enzyme
Mol. Mass.:
40877.05
Organism:
Homo sapiens (Human)
Description:
Q16769
Residue:
361
  
Inhibitor
Name:
BDBM179612
Synonyms:
US9126987, 15
Type:
Small organic molecule
Emp. Form.:
C19H18N4OS
Mol. Mass.:
350.437
SMILES:
Cc1cc(C)c(CSc2nnc(o2)-c2ccc3[nH]cnc3c2)c(C)c1
: