Target
Cholesteryl ester transfer protein
Ligand
BDBM192305
Substrate
Meas. Tech.
CETP Inhibition Assay
Temperature
310.15±n/a K
IC50
6±n/a nM
Comments
extracted
Citation
 Nakamura, TNamiki, HTerasaka, NShima, AHagihara, MIwase, NTakata, KKikuchi, OTsuboike, KSetoguchi, HYoneda, KSunamoto, HIto, K Substituted pyridine compound US Patent  US9187450 Publication Date 11/17/2015 
Target
Name:
Cholesteryl ester transfer protein
Synonyms:
CETP Cholesteryl ester transfer protein (CETP) | Lipid transfer protein I
Type:
Enzyme
Mol. Mass.:
54751.53
Organism:
Homo sapiens (Human)
Description:
P11597
Residue:
493
  
Inhibitor
Name:
BDBM192305
Synonyms:
US9187450, 51
Type:
Small organic molecule
Emp. Form.:
C37H45F6N5O3S
Mol. Mass.:
753.84
SMILES:
CN(Cc1cnc(nc1)N1CCC(CC1)c1nc2CC(C)(C)C[C@H](O)c2c(C2CCC(F)(F)CC2)c1[C@@H](F)c1ccc(cc1)C(F)(F)F)S(C)(=O)=O
: