Target
Neutrophil collagenase
Ligand
BDBM194638
Substrate
Meas. Tech.
In Vitro Fluorescence Assay
pH
7.5±n/a
IC50
17.9±n/a nM
Comments
extracted
Citation
 Durham, TBMarimuthu, JWiley, MR Aggrecanase inhibitors US Patent  US9206139 Publication Date 12/8/2015 
Target
Name:
Neutrophil collagenase
Synonyms:
CLG1 MMP8 Matrix metalloproteinase-8 PMNL collagenase | PMNL-CL
Type:
Enzyme
Mol. Mass.:
53413.48
Organism:
Homo sapiens (Human)
Description:
P22894
Residue:
467
  
Inhibitor
Name:
BDBM194638
Synonyms:
US9206139, 1
Type:
Small organic molecule
Emp. Form.:
C18H20F3N3O3
Mol. Mass.:
383.3649
SMILES:
C[C@H](Cc1ccc(cc1)C(F)(F)F)C(=O)NC[C@]1(NC(=O)NC1=O)C1CC1
: