Target
Lysine-specific demethylase 4C [1-350]
Ligand
BDBM60875
Substrate
Meas. Tech.
KDM4C Enzymatic Screening Assay
pH
7.5±n/a
IC50
13300±n/a nM
Comments
extracted
Citation
 Vinogradova, MGehling, VSGustafson, AArora, STindell, CAWilson, CWilliamson, KEGuler, GDGangurde, PManieri, WBusby, JFlynn, EMLan, FKim, HJOdate, SCochran, AGLiu, YWongchenko, MYang, YCheung, TKMaile, TMLau, TCosta, MHegde, GVJackson, EPitti, RArnott, DBailey, CBellon, SCummings, RTAlbrecht, BKHarmange, JCKiefer, JRTrojer, PClasson, M An inhibitor of KDM5 demethylases reduces survival of drug-tolerant cancer cells. Nat Chem Biol 12:531-8 (2016)  
Target
Name:
Lysine-specific demethylase 4C [1-350]
Synonyms:
GASC1 JMJD2C KDM4C_HUMAN Lysine-specific demethylase 4C (KDM4C)
Type:
Protein
Mol. Mass.:
40626.08
Organism:
Homo sapiens (Human)
Description:
Q9H3R0; His-tagged recombinant KDM4C (1-350) overexpressed in E. coli(DE3)
Residue:
350
  
Inhibitor
Name:
BDBM60875
Synonyms:
3-((6-(4,5-Dihydro-1H-benzo[d]azepin-3(2H)-yl)-2-(pyridin-2-yl)pyrimidin-4-yl)amino)propanoic acid GSK J1 GSKJ1
Type:
Emp. Form.:
C22H23N5O2
Mol. Mass.:
389.4503
SMILES:
OC(=O)CCNc1cc(nc(n1)-c1ccccn1)N1CCc2ccccc2CC1
: