Target
Endothelial lipase
Ligand
BDBM199215
Substrate
Meas. Tech.
Endothelial Lipase Assay
pH
7.2±n/a
IC50
237±n/a nM
Comments
extracted
Citation
 Connelly, MAGreco, MYe, H Tricyclic indole derivatives useful endothelial lipase inhibitors US Patent  US9216998 Publication Date 12/22/2015 
Target
Name:
Endothelial lipase
Synonyms:
EDL Endothelial lipase LIPE_MOUSE | Lipg
Type:
Protein
Mol. Mass.:
56643.58
Organism:
Mus musculus (Mouse)
Description:
Q9WVG5
Residue:
500
  
Inhibitor
Name:
BDBM199215
Synonyms:
US9216998, 21
Type:
Small organic molecule
Emp. Form.:
C23H20F6N2O
Mol. Mass.:
454.4081
SMILES:
FC(F)(F)CC(=O)N1CCn2c(CCc3ccccc3)c(c3cccc(C1)c23)C(F)(F)F
: