Target
Endothelial lipase
Ligand
BDBM199217
Substrate
Meas. Tech.
Endothelial Lipase Assay
pH
7.2±n/a
IC50
346±n/a nM
Comments
extracted
Citation
 Connelly, MAGreco, MYe, H Tricyclic indole derivatives useful endothelial lipase inhibitors US Patent  US9216998 Publication Date 12/22/2015 
Target
Name:
Endothelial lipase
Synonyms:
EDL Endothelial lipase LIPE_MOUSE | Lipg
Type:
Protein
Mol. Mass.:
56643.58
Organism:
Mus musculus (Mouse)
Description:
Q9WVG5
Residue:
500
  
Inhibitor
Name:
BDBM199217
Synonyms:
US9216998, 23
Type:
Small organic molecule
Emp. Form.:
C22H23F3N2O
Mol. Mass.:
388.426
SMILES:
OCCN1CCn2c(CCc3ccccc3)c(c3cccc(C1)c23)C(F)(F)F
: