Target
Mitogen-activated protein kinase 1
Ligand
BDBM201717
Substrate
Meas. Tech.
IMAP-FP Assay
IC50
0.8±n/a nM
Citation
Target
Name:
Mitogen-activated protein kinase 1
Synonyms:
ERK2 Extracellular signal-regulated kinase 2 Extracellular signal-regulated kinase 2 (ERK2) MAPK 2 MK01_HUMAN Mitogen-activated protein kinase 1 (ERK-2) Mitogen-activated protein kinase 2 PRKM2 | p42-MAPK
Type:
Ser/Thr Protein Kinase
Mol. Mass.:
41392.76
Organism:
Homo sapiens (Human)
Description:
P28482
Residue:
360
  
Inhibitor
Name:
BDBM201717
Synonyms:
US9233979, 148
Type:
Small organic molecule
Emp. Form.:
C20H24N6O2
Mol. Mass.:
380.4436
SMILES:
CCNc1n[nH]c2cc(NC(=O)N[C@H]([C@@H]3CCCO3)c3ccccc3)ncc12
: