Target
RAF proto-oncogene serine/threonine-protein kinase [Y340E,Y341E]
Ligand
BDBM202727
Substrate
Meas. Tech.
In Vitro Enzyme Assay
pH
7.5±n/a
Temperature
298.15±n/a K
IC50
0.25±n/a nM
Comments
extracted
Citation
 Barsanti, PABurger, MLou, YNishiguchi, GPolyakov, VRamurthy, SRico, ASetti, LSmith, ATaft, BTanner, HDiPesa, AYusuff, N Biaryl amide compounds as kinase inhibitors US Patent  US9242969 Publication Date 1/26/2016 
Target
Name:
RAF proto-oncogene serine/threonine-protein kinase [Y340E,Y341E]
Synonyms:
C-RAF RAF RAF1 | RAF1_HUMAN
Type:
Mol. Mass.:
73012.38
Organism:
Homo sapiens (Human)
Description:
P04049[Y340E,Y341E]
Residue:
648
  
Inhibitor
Name:
BDBM202727
Synonyms:
US10245267, Example 73 US9242969, 73 | US9694016, 73
Type:
Small organic molecule
Emp. Form.:
C23H24N4O4S
Mol. Mass.:
452.526
SMILES:
Cc1ccc(NC(=O)c2ccnc(c2)S(C)(=O)=O)cc1-c1ccnc(c1)N1CCOCC1
: