Target
Neuraminidase NanB
Ligand
BDBM4706
Substrate
Meas. Tech.
Sialidase Assay
pH
9±n/a
Ki
3.30e+5±n/a nM
Comments
extracted
Citation
 Hayre, JKXu, GBorgianni, LTaylor, GLAndrew, PWDocquier, JDOggioni, MR Optimization of a direct spectrophotometric method to investigate the kinetics and inhibition of sialidases. BMC Biochem 13:19 (2012)  
Target
Name:
Neuraminidase NanB
Synonyms:
Neuraminidase B (NanB)
Type:
Enzyme
Mol. Mass.:
77697.72
Organism:
Streptococcus pneumoniae
Description:
Q54727; spr1531
Residue:
697
  
Inhibitor
Name:
BDBM4706
Synonyms:
(2R,3R,4S)-3-acetamido-4-hydroxy-2-[(1R,2R)-1,2,3-trihydroxypropyl]-3,4-dihydro-2H-pyran-6-carboxylic acid CHEMBL96712 Neu5Ac2en
Type:
Small organic molecule
Emp. Form.:
C11H17NO8
Mol. Mass.:
291.2546
SMILES:
CC(=O)N[C@@H]1[C@@H](O)C=C(O[C@H]1[C@H](O)[C@H](O)CO)C(O)=O
: