Target
5-hydroxytryptamine receptor 7
Ligand
BDBM234388
Substrate
Meas. Tech.
Cell-Based Functional Assay (5-HT7)
IC50
>10000±0 nM
Citation
 Nirogia, RVKambhampati, RDaulatabad, AVGudla, PShaikh, MAchanta, PKShinde, AKDubey, PK Design, synthesis and pharmacological evaluation of conformationally restricted N-arylsulfonyl-3-aminoalkoxy indoles as a potential 5-HT6 receptor ligands. J Enzyme Inhib Med Chem 26:341-9 (2011)  
Target
Name:
5-hydroxytryptamine receptor 7
Synonyms:
5-HT-7 5-HT7 5-HT7S 5-hydroxytryptamine receptor 7 5HT7R_RAT GPRFO Serotonin (5-HT) receptor | Serotonin Receptor 7
Type:
G Protein-Coupled Receptor (GPCR)
Mol. Mass.:
49852.62
Organism:
Rattus norvegicus (rat)
Description:
Rat cloned 5-HT7R.
Residue:
448
  
Inhibitor
Name:
BDBM234388
Synonyms:
3-Chloro-10-(2-N,N-Dimethylaminoethoxy)-5-Thia-4-b-azaindeno (8b)
Type:
Small organic molecule
Emp. Form.:
C18H17ClN2O3S
Mol. Mass.:
376.857
SMILES:
CN(C)CCOc1c2-c3ccccc3S(=O)(=O)n2c2cc(Cl)ccc12
: