Target
Cytochrome P450 11B2, mitochondrial
Ligand
BDBM249227
Substrate
Meas. Tech.
G402-Based Assay
EC50
0.5±n/a nM
Citation
 Aebi, JAmrein, KHornsperger, BKuhn, BMaerki, HPMayweg, AVTan, X Dihydroquinoline-2-one derivatives US Patent  US9458135 Publication Date 10/4/2016 
Target
Name:
Cytochrome P450 11B2, mitochondrial
Synonyms:
Aldosterone Synthase (CYP11B2) Aldosterone-synthesizing enzyme CYP11B2 Cytochrome P450 11B2 Cytochrome P450 11B2, mitochondrial P-450C18 | Steroid 18-hydroxylase
Type:
Protein
Mol. Mass.:
57582.15
Organism:
Homo sapiens (Human)
Description:
P19099
Residue:
503
  
Inhibitor
Name:
BDBM249227
Synonyms:
US9458135, 15
Type:
Small organic molecule
Emp. Form.:
C22H18F3N3OS
Mol. Mass.:
429.458
SMILES:
CN1C(=O)CCc2cc(ccc12)-c1cncc(CSc2ncccc2C(F)(F)F)c1
: