Target
Cytochrome P450 11B1, mitochondrial
Ligand
BDBM249220
Substrate
Meas. Tech.
G402-Based Assay
EC50
72.8±n/a nM
Citation
 Aebi, JAmrein, KHornsperger, BKuhn, BMaerki, HPMayweg, AVTan, X Dihydroquinoline-2-one derivatives US Patent  US9458135 Publication Date 10/4/2016 
Target
Name:
Cytochrome P450 11B1, mitochondrial
Synonyms:
C11B1_HUMAN CYPXIB1 Cytochrome P450 11B1 Cytochrome P450 11B1, mitochondrial | S11BH
Type:
Enzyme
Mol. Mass.:
57591.44
Organism:
Homo sapiens (Human)
Description:
P15538
Residue:
503
  
Inhibitor
Name:
BDBM249220
Synonyms:
US9458135, 8
Type:
Small organic molecule
Emp. Form.:
C22H18F3N3O2
Mol. Mass.:
413.3924
SMILES:
CN1C(=O)CCc2cc(ccc12)-c1cncc(COc2ncccc2C(F)(F)F)c1
: