Target
Proto-oncogene tyrosine-protein kinase receptor Ret [658-1114,V804M]
Ligand
BDBM305730
Substrate
Meas. Tech.
RET Enzyme Assay
IC50
14.0±n/a nM
Citation
 Andrews, SWAronow, SBlake, JFBrandhuber, BJCollier, JCook, AHaas, JJiang, YKolakowski, GRMcFaddin, EAMcKenney, MLMcNulty, OTMetcalf, ATMoreno, DARamann, GATang, TPRen, LWalls, SM Substituted pyrazolo[1,5-A]pyridine compounds as RET kinase inhibitors US Patent  US10441581 Publication Date 10/15/2019 
Target
Name:
Proto-oncogene tyrosine-protein kinase receptor Ret [658-1114,V804M]
Synonyms:
CDHF12 PTC Proto-oncogene tyrosine-protein kinase receptor Ret (V804M) RET Kinase (V804M) (aa658-end) RET_HUMAN
Type:
Enzyme Catalytic Domain
Mol. Mass.:
51567.23
Organism:
Homo sapiens (Human)
Description:
P07949[658-1114,V804M]
Residue:
457
  
Inhibitor
Name:
BDBM305730
Synonyms:
4-(6-(4-(4-fluorobenzyl)- 4-hydroxypiperidin-1- yl)pyridin-3-yl)-6-(2- hydroxy-2- methylpropoxy) pyrazolo[1,5-a] pyridine-3-carbonitrile US10172845, Example 748 US10881652, Example 748 | US11648243, Example 748
Type:
Small organic molecule
Emp. Form.:
C29H30FN5O3
Mol. Mass.:
515.5786
SMILES:
CC(C)(O)COc1cc(-c2ccc(nc2)N2CCC(O)(Cc3ccc(F)cc3)CC2)c2c(cnn2c1)C#N
: