Target
Bone morphogenetic protein receptor type-1A [198-525]
Ligand
BDBM451771
Substrate
Meas. Tech.
ADPGlo Assay
IC50
1050±n/a nM
Citation
 Arista, LBabu, SBian, JCui, KDillon, MPLattmann, RLi, JLiao, LLizos, DRamos, RStiefl, NJUllrich, TUsselmann, PWang, XWaykole, LMWeiler, SZhang, YZhou, YZhu, T Aminopyridine derivatives and their use as selective ALK-2 inhibitors US Patent  US10710980 Publication Date 7/14/2020 
Target
Name:
Bone morphogenetic protein receptor type-1A [198-525]
Synonyms:
ACVRLK3 Activin receptor-like kinase 3 (ALK3) (aa 198-525) BMPR1A | BMR1A_HUMAN
Type:
Enzyme Catalytic Domain
Mol. Mass.:
37140.17
Organism:
Homo sapiens (Human)
Description:
aa 198-525
Residue:
328
  
Inhibitor
Name:
BDBM451771
Synonyms:
US10710980, Example 3 | US10947218, Example 3
Type:
Small organic molecule
Emp. Form.:
C25H32N4O3
Mol. Mass.:
436.5466
SMILES:
C[C@@H](N1CC2(COC2)C1)c1ccc(cc1)-c1cnc(N)c(c1)C(=O)N[C@H]1CC[C@H](O)CC1
: