Target
Serine/threonine-protein kinase receptor R3 [166-493]
Ligand
BDBM451813
Substrate
Meas. Tech.
Caliper Assay
IC50
170±n/a nM
Citation
 Arista, LBabu, SBian, JCui, KDillon, MPLattmann, RLi, JLiao, LLizos, DRamos, RStiefl, NJUllrich, TUsselmann, PWang, XWaykole, LMWeiler, SZhang, YZhou, YZhu, T Aminopyridine derivatives and their use as selective ALK-2 inhibitors US Patent  US10710980 Publication Date 7/14/2020 
Target
Name:
Serine/threonine-protein kinase receptor R3 [166-493]
Synonyms:
ACVL1_HUMAN ACVRLK1 Activin receptor-like kinase 1 (ALK1)(aa 166-493)
Type:
Enzyme Catalytic Domain
Mol. Mass.:
36974.75
Organism:
Homo sapiens (Human)
Description:
aa 166-493
Residue:
328
  
Inhibitor
Name:
BDBM451813
Synonyms:
US10710980, Example 44 | US10947218, Example 44
Type:
Small organic molecule
Emp. Form.:
C28H36N4O4S
Mol. Mass.:
524.675
SMILES:
Nc1ncc(cc1C(=O)N[C@H]1CC[C@H](O)CC1)-c1ccc(cc1)[C@@]12C[C@@H]1CN(C2)C1CCS(=O)(=O)CC1
: