Target
Non-receptor tyrosine-protein kinase TYK2
Ligand
BDBM463696
Substrate
Meas. Tech.
Caliper Assay
Ki
0.05±n/a nM
Citation
 Masse, CEGreenwood, JRRomero, DLHarriman, GCWester, RTShelley, MKennedy-Smith, JJDahlgren, MMondal, SRobinson, S TYK2 inhibitors and uses thereof US Patent  US10781204 Publication Date 9/22/2020 
Target
Name:
Non-receptor tyrosine-protein kinase TYK2
Synonyms:
Non-receptor tyrosine-protein kinase TYK2 (TYK2) TYK2_HUMAN | Tyrosine-protein kinase TYK2
Type:
Protein
Mol. Mass.:
133666.03
Organism:
Homo sapiens (Human)
Description:
P29597
Residue:
1187
  
Inhibitor
Name:
BDBM463696
Synonyms:
US10781204, Compound I-173 | US11434240, Compound I-173
Type:
Small organic molecule
Emp. Form.:
C22H18F2N6O2
Mol. Mass.:
436.4141
SMILES:
O[C@H]1CN(CC[C@H]1F)c1ccn(n1)-c1cc(nc2CNC(=O)c12)-c1c(F)cccc1C#N
: