Target
Mast/stem cell growth factor receptor Kit
Ligand
BDBM301795
Substrate
Meas. Tech.
KIT Kinase Assay
IC50
109±n/a nM
Citation
 Lombardi Borgia, ACiomei, MDonati, DNesi, M Substituted indazole derivatives active as kinase inhibitiors US Patent  US9597317 Publication Date 3/21/2017 
Target
Name:
Mast/stem cell growth factor receptor Kit
Synonyms:
CD117 antigen KIT Mast/stem cell growth factor receptor Kit (cKIT) Proto-oncogene tyrosine-protein kinase Kit Stem cell growth factor receptor Tyrosine-protein kinase Kit c-kit v-kit Hardy-Zuckerman 4 feline sarcoma viral oncogene homolog
Type:
Protein
Mol. Mass.:
109869.37
Organism:
Homo sapiens (Human)
Description:
P10721
Residue:
976
  
Inhibitor
Name:
BDBM301795
Synonyms:
N-[6-(2-Benzyloxy-ethoxy)-1H-indazol-3-yl]-4-methyl-(1-methylpiperidin-4-yl)-amino-benzamide | US9597317, 23
Type:
Small organic molecule
Emp. Form.:
C30H35N5O3
Mol. Mass.:
513.6306
SMILES:
CN1CCC(CC1)c1c(C)ccc(C(=O)Nc2n[nH]c3cc(OCCOCc4ccccc4)ccc23)c1N
: