Target
Replicase polyprotein 1ab
Ligand
BDBM429304
Substrate
Meas. Tech.
Antiviral assay
EC50
2800±n/a nM
Citation
 Ghosh, AKRaghavaiah, JShahabi, DYadav, MAnson, BJLendy, EKHattori, SIHigashi-Kuwata, NMitsuya, HMesecar, AD Indole Chloropyridinyl Ester-Derived SARS-CoV-2 3CLpro Inhibitors: Enzyme Inhibition, Antiviral Efficacy, Structure-Activity Relationship, and X-ray Structural Studies. J Med Chem 64:14702-14714 (2021)  
Target
Name:
Replicase polyprotein 1ab
Synonyms:
ORF1ab polyprotein pp1ab | rep
Type:
Protein
Mol. Mass.:
794070.71
Organism:
2019-nCoV
Description:
P0DTD1
Residue:
7096
  
Inhibitor
Name:
BDBM429304
Synonyms:
CVD-0006354 indole chloropyridinyl-ester derived, 1 | jm5b01461, Compound 124
Type:
Small Organic Molecule
Emp. Form.:
C14H9ClN2O2
Mol. Mass.:
272.686
SMILES:
Clc1cncc(OC(=O)c2cccc3[nH]ccc23)c1
: