Target
Replicase polyprotein 1ab
Ligand
BDBM496882
Substrate
Meas. Tech.
IC50 Value Determination
IC50
489±n/a nM
Citation
 Ghosh, AKRaghavaiah, JShahabi, DYadav, MAnson, BJLendy, EKHattori, SIHigashi-Kuwata, NMitsuya, HMesecar, AD Indole Chloropyridinyl Ester-Derived SARS-CoV-2 3CLpro Inhibitors: Enzyme Inhibition, Antiviral Efficacy, Structure-Activity Relationship, and X-ray Structural Studies. J Med Chem 64:14702-14714 (2021)  
Target
Name:
Replicase polyprotein 1ab
Synonyms:
ORF1ab polyprotein pp1ab | rep
Type:
Protein
Mol. Mass.:
794070.71
Organism:
2019-nCoV
Description:
P0DTD1
Residue:
7096
  
Inhibitor
Name:
BDBM496882
Synonyms:
indole chloropyridinyl-ester derived, 7k
Type:
Small Organic Molecule
Emp. Form.:
C14H10ClN3O2
Mol. Mass.:
287.701
SMILES:
Cc1nc2c(cccc2[nH]1)C(=O)Oc1cncc(Cl)c1
: