Target
Serine protease HTRA1
Ligand
BDBM496811
Substrate
Meas. Tech.
Enzyme Inhibition Assay
IC50
0.838±n/a nM
Citation
 Hornsperger, BMaerki, HPMohr, PReutlinger, MRudolph, M Difluoroketamide derivatives as HTRA1 inhibitors US Patent  US11001555 Publication Date 5/11/2021 
Target
Name:
Serine protease HTRA1
Synonyms:
HTRA HTRA1_HUMAN | PRSS11
Type:
Protein
Mol. Mass.:
51293.95
Organism:
Homo sapiens (Human)
Description:
Q92743
Residue:
480
  
Inhibitor
Name:
BDBM496811
Synonyms:
US11001555, Example 2
Type:
Small organic molecule
Emp. Form.:
C33H36ClF7N4O8S
Mol. Mass.:
817.168
SMILES:
COc1ccc(CS(=O)(=O)[C@@H]2C[C@H](N(C2)C(=O)[C@H](C)NC(=O)C(F)(F)c2cccc(Cl)c2)C(=O)N[C@@H](C(C)C)C(=O)C(F)(F)C(=O)NCC(F)(F)F)cc1
: