Target
Serine protease HTRA1
Ligand
BDBM496997
Substrate
Meas. Tech.
Enzyme Inhibition Assay
IC50
0.574±n/a nM
Citation
 Hornsperger, BMaerki, HPMohr, PReutlinger, MRudolph, M Difluoroketamide derivatives as HTRA1 inhibitors US Patent  US11001555 Publication Date 5/11/2021 
Target
Name:
Serine protease HTRA1
Synonyms:
HTRA HTRA1_HUMAN | PRSS11
Type:
Protein
Mol. Mass.:
51293.95
Organism:
Homo sapiens (Human)
Description:
Q92743
Residue:
480
  
Inhibitor
Name:
BDBM496997
Synonyms:
N-[(2S)-3-(3,4-Dichlorophenyl)-1-[(2S,4R)-2-[[(3S)-5,5-difluoro-2-methyl-4,6-dioxo-6-(2,2,2-trifluoroethylamino)hexan-3-yl]carbamoyl]-4-[(4-methoxyphenyl)methylsulfonyl]pyrrolidin-1-yl]-1-oxopropan-2-yl]pyridine-2-carboxamide | US11001555, Example 21
Type:
Small organic molecule
Emp. Form.:
C37H38Cl2F5N5O8S
Mol. Mass.:
878.689
SMILES:
COc1ccc(CS(=O)(=O)[C@@H]2C[C@H](N(C2)C(=O)[C@H](Cc2ccc(Cl)c(Cl)c2)NC(=O)c2ccccn2)C(=O)N[C@@H](C(C)C)C(=O)C(F)(F)C(=O)NCC(F)(F)F)cc1
: