Target
Tyrosine-protein phosphatase non-receptor type 11
Ligand
BDBM497074
Substrate
Meas. Tech.
Biochemical Assay
IC50
6000±n/a nM
Citation
 Jorand-Lebrun, CBoivin, RJohnson, TWang, YXiao, YChen, XLinde, NMusch, DKumar, D Pyrimidinone derivatives as SHP2 antagonists US Patent  US11001561 Publication Date 5/11/2021 
Target
Name:
Tyrosine-protein phosphatase non-receptor type 11
Synonyms:
PTN11_HUMAN PTP-2C PTPN11 Protein tyrosine phosphatase (PTP) Shp2 Protein-tyrosine phosphatase 2C SHP2 Src homology phosphatase 2 (SHP-2) Tyrosine-protein phosphatase non-receptor type 11 (PTPN11) Tyrosine-protein phosphatase non-receptor type 11 (SHP2)
Type:
Protein phosphatase
Mol. Mass.:
68443.59
Organism:
Homo sapiens (Human)
Description:
Q06124
Residue:
597
  
Inhibitor
Name:
BDBM497074
Synonyms:
US11001561, Compound 63 US11104675, Example 10b | US11702392, Compound 63
Type:
Small organic molecule
Emp. Form.:
C21H26Cl2N4O2
Mol. Mass.:
437.363
SMILES:
C[C@@H]1OCC2(CCN(CC2)c2nc(C)n(-c3cccc(Cl)c3Cl)c(=O)c2C)[C@@H]1N
: